Target
Cathepsin B
Ligand
BDBM50107638
Substrate
Meas. Tech.
ChEMBL_47411 (CHEMBL657288)
IC50
10.2±n/a nM
Citation
 Greenspan, PDClark, KLTommasi, RACowen, SDMcQuire, LWFarley, DLvan Duzer, JHGoldberg, RLZhou, HDu, ZFitt, JJCoppa, DEFang, ZMacchia, WZhu, LCapparelli, MPGoldstein, RWigg, AMDoughty, JRBohacek, RSKnap, AK Identification of dipeptidyl nitriles as potent and selective inhibitors of cathepsin B through structure-based drug design. J Med Chem 44:4524-34 (2001)  
Target
Name:
Cathepsin B
Synonyms:
APP secretase CATB_HUMAN CTSB Cathepsin B light chain | Cathepsin B1
Type:
Enzyme
Mol. Mass.:
37819.69
Organism:
Homo sapiens (Human)
Description:
gi_63102437
Residue:
339
  
Inhibitor
Name:
BDBM50107638
Synonyms:
CHEMBL336436 | N-(Benzyloxymethyl-cyano-methyl)-2-diphenylacetylamino-3-m-tolyl-propionamide
Type:
Small organic molecule
Emp. Form.:
C34H33N3O3
Mol. Mass.:
531.6441
SMILES:
Cc1cccc(C[C@H](NC(=O)C(c2ccccc2)c2ccccc2)C(=O)N[C@@H](COCc2ccccc2)C#N)c1
: