Target
Procathepsin L
Ligand
BDBM50107635
Substrate
Meas. Tech.
ChEMBL_48365 (CHEMBL661681)
IC50
170±n/a nM
Citation
 Greenspan, PDClark, KLTommasi, RACowen, SDMcQuire, LWFarley, DLvan Duzer, JHGoldberg, RLZhou, HDu, ZFitt, JJCoppa, DEFang, ZMacchia, WZhu, LCapparelli, MPGoldstein, RWigg, AMDoughty, JRBohacek, RSKnap, AK Identification of dipeptidyl nitriles as potent and selective inhibitors of cathepsin B through structure-based drug design. J Med Chem 44:4524-34 (2001)  
Target
Name:
Procathepsin L
Synonyms:
CATL1_HUMAN CTSL CTSL1 Cathepsin L Cathepsin L1 heavy chain MEP cathepsin L preproprotein
Type:
Enzyme
Mol. Mass.:
37557.19
Organism:
Homo sapiens (Human)
Description:
Purchased from Calbiochem (San Diego, CA).
Residue:
333
  
Inhibitor
Name:
BDBM50107635
Synonyms:
CHEMBL140794 | N-Cyanomethyl-3-phenyl-2-phenylacetylamino-propionamide
Type:
Small organic molecule
Emp. Form.:
C19H19N3O2
Mol. Mass.:
321.3731
SMILES:
O=C(Cc1ccccc1)N[C@@H](Cc1ccccc1)C(=O)NCC#N
: