Target
Muscarinic acetylcholine receptor M1
Ligand
BDBM50107698
Substrate
Meas. Tech.
ChEMBL_138408 (CHEMBL744770)
Ki
0.19±n/a nM
Citation
 Rajeswaran, WGCao, YHuang, XPWroblewski, MEColclough, TLee, SLiu, FNagy, PIEllis, JLevine, BANocka, KHMesser, WS Design, synthesis, and biological characterization of bivalent 1-methyl-1,2,5,6-tetrahydropyridyl-1,2,5-thiadiazole derivatives as selective muscarinic agonists. J Med Chem 44:4563-76 (2001)  
Target
Name:
Muscarinic acetylcholine receptor M1
Synonyms:
ACM1_HUMAN Cholinergic receptor, muscarinic 1 | Cholinergic, muscarinic M1
Type:
Protein
Mol. Mass.:
51442.54
Organism:
Homo sapiens (Human)
Description:
P11229
Residue:
460
  
Inhibitor
Name:
BDBM50107698
Synonyms:
1,8-di[4-(1-methyl-1,2,3,6-tetrahydro-5-pyridinyl)-1,2,5-thiadiazol-3-yloxy]octane | CHEMBL141452
Type:
Small organic molecule
Emp. Form.:
C24H36N6O2S2
Mol. Mass.:
504.712
SMILES:
CN1CCC=C(C1)c1nsnc1OCCCCCCCCOc1nsnc1C1=CCCN(C)C1
: