Target
Tyrosine-protein kinase SYK
Ligand
BDBM50548350
Substrate
Meas. Tech.
ChEMBL_2021861 (CHEMBL4675674)
IC50
0.060000±n/a nM
Citation
 Grimster, NPGingipalli, LBarlaam, BSu, QZheng, XWatson, DWang, HSimpson, IPike, ABalazs, ABoiko, SIkeda, TPImpastato, ACJones, NHKawatkar, SKemmitt, PLamont, SPatel, JRead, JSarkar, USha, LTomlinson, RCWang, HWilson, DMZehnder, TEWang, LWang, PGoldberg, FWShao, WFawell, SDry, HDowling, JEEdmondson, SD Optimization of a series of potent, selective and orally bioavailable SYK inhibitors. Bioorg Med Chem Lett 30:0 (2020)  
Target
Name:
Tyrosine-protein kinase SYK
Synonyms:
KSYK_HUMAN Spleen Tyrosine Kinase Tyrosine-protein kinase SYK (Syk)
Type:
Enzyme
Mol. Mass.:
72079.99
Organism:
Homo sapiens (Human)
Description:
P43405
Residue:
635
  
Inhibitor
Name:
BDBM50548350
Synonyms:
CHEMBL4780257
Type:
Small organic molecule
Emp. Form.:
C22H25N9O2
Mol. Mass.:
447.493
SMILES:
CNC(=O)c1nn(C)c2ccc(Nc3nccc(n3)-n3cc(CN4CC(O)C4)c(C)n3)cc12
: