Target
Apolipoprotein B-100
Ligand
BDBM50107767
Substrate
Meas. Tech.
ChEMBL_217986 (CHEMBL824105)
IC50
8.7±n/a nM
Citation
 Ksander, GMdeJesus, RYuan, AFink, CMoskal, MCarlson, EKukkola, PBilci, NWallace, ENeubert, AFeldman, DMogelesky, TPoirier, KJeune, MSteele, RWasvery, JStephan, ZCahill, EWebb, RNavarrete, ALee, WGibson, JAlexander, NSharif, HHospattankar, A Diaminoindanes as microsomal triglyceride transfer protein inhibitors. J Med Chem 44:4677-87 (2001)  
Target
Name:
Apolipoprotein B-100
Synonyms:
APOB Apo B-100 Apolipoprotein B-100 | Apolipoprotein B-48
Type:
PROTEIN
Mol. Mass.:
515630.53
Organism:
Homo sapiens (Human)
Description:
ChEMBL_217986
Residue:
4563
  
Inhibitor
Name:
BDBM50107767
Synonyms:
CHEMBL358538 | {5-[(4'-Chloro-6-methyl-biphenyl-2-carbonyl)-amino]-indan-2-ylmethyl}-carbamic acid methyl ester
Type:
Small organic molecule
Emp. Form.:
C26H25ClN2O3
Mol. Mass.:
448.941
SMILES:
COC(=O)NCC1Cc2ccc(NC(=O)c3cccc(C)c3-c3ccc(Cl)cc3)cc2C1
: