Target
Apolipoprotein B-100
Ligand
BDBM50107777
Substrate
Meas. Tech.
ChEMBL_217986 (CHEMBL824105)
IC50
2.6±n/a nM
Citation
 Ksander, GMdeJesus, RYuan, AFink, CMoskal, MCarlson, EKukkola, PBilci, NWallace, ENeubert, AFeldman, DMogelesky, TPoirier, KJeune, MSteele, RWasvery, JStephan, ZCahill, EWebb, RNavarrete, ALee, WGibson, JAlexander, NSharif, HHospattankar, A Diaminoindanes as microsomal triglyceride transfer protein inhibitors. J Med Chem 44:4677-87 (2001)  
Target
Name:
Apolipoprotein B-100
Synonyms:
APOB Apo B-100 Apolipoprotein B-100 | Apolipoprotein B-48
Type:
PROTEIN
Mol. Mass.:
515630.53
Organism:
Homo sapiens (Human)
Description:
ChEMBL_217986
Residue:
4563
  
Inhibitor
Name:
BDBM50107777
Synonyms:
4,6-Dimethyl-4'-trifluoromethyl-biphenyl-2-carboxylic acid [2-(thiophene-2-sulfonylamino)-indan-5-yl]-amide | CHEMBL344849
Type:
Small organic molecule
Emp. Form.:
C29H25F3N2O3S2
Mol. Mass.:
570.646
SMILES:
Cc1cc(C)c(-c2ccc(cc2)C(F)(F)F)c(c1)C(=O)Nc1ccc2C[C@@H](Cc2c1)NS(=O)(=O)c1cccs1
: