Target
Apolipoprotein B-100
Ligand
BDBM50107778
Substrate
Meas. Tech.
ChEMBL_217986 (CHEMBL824105)
IC50
12±n/a nM
Citation
 Ksander, GMdeJesus, RYuan, AFink, CMoskal, MCarlson, EKukkola, PBilci, NWallace, ENeubert, AFeldman, DMogelesky, TPoirier, KJeune, MSteele, RWasvery, JStephan, ZCahill, EWebb, RNavarrete, ALee, WGibson, JAlexander, NSharif, HHospattankar, A Diaminoindanes as microsomal triglyceride transfer protein inhibitors. J Med Chem 44:4677-87 (2001)  
Target
Name:
Apolipoprotein B-100
Synonyms:
APOB Apo B-100 Apolipoprotein B-100 | Apolipoprotein B-48
Type:
PROTEIN
Mol. Mass.:
515630.53
Organism:
Homo sapiens (Human)
Description:
ChEMBL_217986
Residue:
4563
  
Inhibitor
Name:
BDBM50107778
Synonyms:
Biphenyl-2-carboxylic acid (2-benzenesulfonylamino-indan-5-yl)-amide | CHEMBL143535
Type:
Small organic molecule
Emp. Form.:
C28H24N2O3S
Mol. Mass.:
468.567
SMILES:
O=C(Nc1ccc2CC(Cc2c1)NS(=O)(=O)c1ccccc1)c1ccccc1-c1ccccc1
: