Target
Apolipoprotein B-100
Ligand
BDBM50107810
Substrate
Meas. Tech.
ChEMBL_217986 (CHEMBL824105)
IC50
1.8±n/a nM
Citation
 Ksander, GMdeJesus, RYuan, AFink, CMoskal, MCarlson, EKukkola, PBilci, NWallace, ENeubert, AFeldman, DMogelesky, TPoirier, KJeune, MSteele, RWasvery, JStephan, ZCahill, EWebb, RNavarrete, ALee, WGibson, JAlexander, NSharif, HHospattankar, A Diaminoindanes as microsomal triglyceride transfer protein inhibitors. J Med Chem 44:4677-87 (2001)  
Target
Name:
Apolipoprotein B-100
Synonyms:
APOB Apo B-100 Apolipoprotein B-100 | Apolipoprotein B-48
Type:
PROTEIN
Mol. Mass.:
515630.53
Organism:
Homo sapiens (Human)
Description:
ChEMBL_217986
Residue:
4563
  
Inhibitor
Name:
BDBM50107810
Synonyms:
6-Methyl-4'-trifluoromethyl-biphenyl-2-carboxylic acid (2-methanesulfonylamino-indan-5-yl)-amide | CHEMBL359428
Type:
Small organic molecule
Emp. Form.:
C25H23F3N2O3S
Mol. Mass.:
488.522
SMILES:
Cc1cccc(C(=O)Nc2ccc3C[C@H](Cc3c2)NS(C)(=O)=O)c1-c1ccc(cc1)C(F)(F)F
: