Target
Excitatory amino acid transporter 3
Ligand
BDBM50107948
Substrate
Meas. Tech.
ChEMBL_68330 (CHEMBL680701)
IC50
>1000000±n/a nM
Citation
 Stensbøl, TBUhlmann, PMorel, SEriksen, BLFelding, JKromann, HHermit, MBGreenwood, JRBraüner-Osborne, HMadsen, UJunager, FKrogsgaard-Larsen, PBegtrup, MVedsø, P Novel 1-hydroxyazole bioisosteres of glutamic acid. Synthesis, protolytic properties, and pharmacology. J Med Chem 45:19-31 (2001)  
Target
Name:
Excitatory amino acid transporter 3
Synonyms:
EAA3_HUMAN EAAT3 HEAAC1 | SLC1A1
Type:
Enzyme Catalytic Domain
Mol. Mass.:
57096.71
Organism:
Homo sapiens (Human)
Description:
Excitatory Amino Acid EAAT3 0 HUMAN::P43005
Residue:
524
  
Inhibitor
Name:
BDBM50107948
Synonyms:
2-Amino-3-(2-hydroxy-2H-pyrazol-3-yl)-propionic acid | CHEMBL320290
Type:
Small organic molecule
Emp. Form.:
C6H9N3O3
Mol. Mass.:
171.154
SMILES:
NC(Cc1ccnn1O)C(O)=O
: