Target
Dihydrofolate reductase
Ligand
BDBM50107967
Substrate
Meas. Tech.
ChEMBL_54089 (CHEMBL669986)
IC50
6100±n/a nM
Citation
 Debnath, AK Pharmacophore mapping of a series of 2,4-diamino-5-deazapteridine inhibitors of Mycobacterium avium complex dihydrofolate reductase. J Med Chem 45:41-53 (2001)  
Target
Name:
Dihydrofolate reductase
Synonyms:
DHFR Dihydrofolate reductase (DHFR) | Tetrahydrofolate dehydrogenase
Type:
Enzyme
Mol. Mass.:
21453.99
Organism:
Homo sapiens (Human)
Description:
Recombinant human DHFR.
Residue:
187
  
Inhibitor
Name:
BDBM50107967
Synonyms:
6-[(3,4-Dimethoxy-phenylamino)-methyl]-5-methoxymethyl-pyrido[2,3-d]pyrimidine-2,4-diamine | CHEMBL151129
Type:
Small organic molecule
Emp. Form.:
C18H22N6O3
Mol. Mass.:
370.4057
SMILES:
COCc1c(CNc2ccc(OC)c(OC)c2)cnc2nc(N)nc(N)c12
: