Target
Cytochrome P450 1A1
Ligand
BDBM50085526
Substrate
Meas. Tech.
ChEMBL_51348 (CHEMBL664422)
IC50
750±n/a nM
Citation
 Kim, SKo, HPark, JEJung, SLee, SKChun, YJ Design, synthesis, and discovery of novel trans-stilbene analogues as potent and selective human cytochrome P450 1B1 inhibitors. J Med Chem 45:160-4 (2001)  
Target
Name:
Cytochrome P450 1A1
Synonyms:
CP1A1_HUMAN CYPIA1 Cytochrome P450 1A1 P450 form 6 P450-P1
Type:
Protein
Mol. Mass.:
58177.23
Organism:
Homo sapiens (Human)
Description:
P04798
Residue:
512
  
Inhibitor
Name:
BDBM50085526
Synonyms:
(E)-3,5,30,40-Tetramethoxystilbene 4-[2-(3,5-dimethoxyphenyl)-(E)-1-ethenyl]-1,2-dimethoxybenzene | CHEMBL44509
Type:
Small organic molecule
Emp. Form.:
C18H20O4
Mol. Mass.:
300.349
SMILES:
COc1cc(OC)cc(\C=C\c2ccc(OC)c(OC)c2)c1
: