Target
Gastrin/cholecystokinin type B receptor
Ligand
BDBM50092567
Substrate
Meas. Tech.
ChEBML_48590
IC50
202±n/a nM
Citation
 Martín-Martínez, MLatorre, MGarcía-López, MTCenarruzabeitia, EDel Río, JGonzález-Muñiz, R Effects of the incorporation of IBTM beta-turn mimetics into the dipeptoid CCK(1) receptor agonist PD 170292. Bioorg Med Chem Lett 12:109-12 (2001)  
Target
Name:
Gastrin/cholecystokinin type B receptor
Synonyms:
Cckbr Cholecystokinin B receptor GASR_RAT | Gastrin/cholecystokinin type B receptor
Type:
Enzyme Catalytic Domain
Mol. Mass.:
48980.43
Organism:
RAT
Description:
Cholecystokinin A CCKBR RAT::P30553
Residue:
452
  
Inhibitor
Name:
BDBM50092567
Synonyms:
(2R,5R,11bS,1'S)-2-[(2-Benzyloxycarbonylamino-3-oxo-2,3,5,6,11,11b-hexahydro-1H-indolizino[8,7-b]indole-5-carbonyl)-amino]-3-phenyl-propionic acid (S)-2-[((5R,11bS)-2-Benzyloxycarbonylamino-3-oxo-2,3,5,6,11,11b-hexahydro-1H-indolizino[8,7-b]indole-5-carbonyl)-amino]-3-phenyl-propionic acid | CHEMBL13577
Type:
Small organic molecule
Emp. Form.:
C32H30N4O6
Mol. Mass.:
566.6038
SMILES:
OC(=O)[C@H](Cc1ccccc1)NC(=O)[C@H]1Cc2c([nH]c3ccccc23)[C@@H]2C[C@@H](NC(=O)OCc3ccccc3)C(=O)N12
: