Target
Sorbitol dehydrogenase
Ligand
BDBM50108767
Substrate
Meas. Tech.
ChEMBL_201010 (CHEMBL882165)
IC50
740±n/a nM
Citation
 Chu-Moyer, MYBallinger, WEBeebe, DABerger, RCoutcher, JBDay, WWLi, JMylari, BLOates, PJWeekly, RM Orally-effective, long-acting sorbitol dehydrogenase inhibitors: synthesis, structure-activity relationships, and in vivo evaluations of novel heterocycle-substituted piperazino-pyrimidines. J Med Chem 45:511-28 (2002)  
Target
Name:
Sorbitol dehydrogenase
Synonyms:
DHSO_HUMAN SORD
Type:
PROTEIN
Mol. Mass.:
38332.20
Organism:
Homo sapiens (Human)
Description:
ChEMBL_223910
Residue:
357
  
Inhibitor
Name:
BDBM50108767
Synonyms:
CHEMBL148647 | [4-(4-Benzooxazol-2-yl-piperazin-1-yl)-pyrimidin-2-yl]-methanol
Type:
Small organic molecule
Emp. Form.:
C16H17N5O2
Mol. Mass.:
311.3385
SMILES:
OCc1nccc(n1)N1CCN(CC1)c1nc2ccccc2o1
: