Target
5-hydroxytryptamine receptor 1A
Ligand
BDBM50109055
Substrate
Meas. Tech.
ChEMBL_947 (CHEMBL616126)
Ki
78±n/a nM
Citation
 Mewshaw, REMeagher, KLZhou, PZhou, DShi, XScerni, RSmith, DSchechter, LEAndree, TH Studies toward the discovery of the next generation of antidepressants. Part 2: incorporating a 5-HT(1A) antagonist component into a class of serotonin reuptake inhibitors. Bioorg Med Chem Lett 12:307-10 (2002)  
Target
Name:
5-hydroxytryptamine receptor 1A
Synonyms:
5-HT-1A 5-hydroxytryptamine receptor 1A (5-HT-1A) ADRB2RL1 Dopamine D2 receptor and serotonin 1a receptor HTR1A | Serotonin receptor 1A
Type:
Mol. Mass.:
46122.49
Organism:
Homo sapiens (Human)
Description:
Residue:
422
  
Inhibitor
Name:
BDBM50109055
Synonyms:
3-{1-[2-(2,3-Dihydro-benzo[1,4]dioxin-5-yloxy)-ethyl]-1,2,3,6-tetrahydro-pyridin-4-yl}-1H-indole | CHEMBL104144
Type:
Small organic molecule
Emp. Form.:
C23H24N2O3
Mol. Mass.:
376.4483
SMILES:
C(CN1CCC(=CC1)c1c[nH]c2ccccc12)Oc1cccc2OCCOc12
: