Target
Phosphatidylinositol 4,5-bisphosphate 3-kinase catalytic subunit gamma isoform
Ligand
BDBM50549829
Substrate
Meas. Tech.
ChEMBL_2025880 (CHEMBL4679693)
Ki
3.0±n/a nM
Citation
 Bandarage, UKAronov, AMCao, JCome, JHCottrell, KMDavies, RJGiroux, SJacobs, MMahajan, SMessersmith, DMoody, CSSwett, RXu, J Discovery of a Novel Series of Potent and Selective Alkynylthiazole-Derived PI3K? Inhibitors. ACS Med Chem Lett 12:129-135 (2021)  
Target
Name:
Phosphatidylinositol 4,5-bisphosphate 3-kinase catalytic subunit gamma isoform
Synonyms:
PI3-kinase p110 subunit gamma PI3Kgamma PK3CG_HUMAN Phosphatidylinositol 4,5-bisphosphate 3-kinase (PI3K) Phosphatidylinositol 4,5-bisphosphate 3-kinase catalytic subunit gamma (PI3Kgamma) Phosphatidylinositol 4,5-bisphosphate 3-kinase catalytic subunit gamma isoform (PI3K) Phosphatidylinositol-4,5-bisphosphate 3-kinase catalytic subunit gamma isoform Phosphoinositide 3-kinases gamma (PI3K gamma) p120-PI3K
Type:
Enzyme Subunit
Mol. Mass.:
126470.30
Organism:
Homo sapiens (Human)
Description:
P48736
Residue:
1102
  
Inhibitor
Name:
BDBM50549829
Synonyms:
CHEMBL4760520
Type:
Small organic molecule
Emp. Form.:
C19H18F2N6OS
Mol. Mass.:
416.448
SMILES:
Cc1nc(NC(=O)NCCc2cn(CC(F)F)cn2)sc1C#Cc1ccncc1
: