Target
Metabotropic glutamate receptor 5
Ligand
BDBM50084141
Substrate
Meas. Tech.
ChEBML_106721
IC50
1100±n/a nM
Citation
 Gasparini, FAndres, HFlor, PJHeinrich, MInderbitzin, WLingenhöhl, KMüller, HMunk, VCOmilusik, KStierlin, CStoehr, NVranesic, IKuhn, R [(3)H]-M-MPEP, a potent, subtype-selective radioligand for the metabotropic glutamate receptor subtype 5. Bioorg Med Chem Lett 12:407-9 (2002)  
Target
Name:
Metabotropic glutamate receptor 5
Synonyms:
GPRC1E GRM5_HUMAN metabotropic glutamate 5 | metabotropic glutamate 5a
Type:
Enzyme
Mol. Mass.:
132484.72
Organism:
Homo sapiens (Human)
Description:
Residue:
1212
  
Inhibitor
Name:
BDBM50084141
Synonyms:
(E)-2-methyl-6-styrylpyridine 2-Methyl-6-styryl-pyridine(SIB-1893) SIB-1757
Type:
Small organic molecule
Emp. Form.:
C14H13N
Mol. Mass.:
195.2597
SMILES:
Cc1cccc(\C=C\c2ccccc2)n1
: