Target
Proto-oncogene tyrosine-protein kinase Src
Ligand
BDBM6477
Substrate
Meas. Tech.
ChEMBL_70342 (CHEMBL677167)
IC50
210±n/a nM
Citation
 Zhang, NWu, BWissner, APowell, DWRabindran, SKKohler, CBoschelli, F 4-Anilino-3-cyanobenzo[g]quinolines as kinase inhibitors. Bioorg Med Chem Lett 12:423-5 (2002)  
Target
Name:
Proto-oncogene tyrosine-protein kinase Src
Synonyms:
Calmodulin/Proto-oncogene tyrosine-protein kinase Src Proto-oncogene c-Src SRC SRC_HUMAN V-src sarcoma (Schmidt-Ruppin A-2) viral oncogene homolog (avian) p60-Src | pp60c-src
Type:
Protein
Mol. Mass.:
59838.60
Organism:
Homo sapiens (Human)
Description:
P12931
Residue:
536
  
Inhibitor
Name:
BDBM6477
Synonyms:
4-Anilino-7,8-dialkoxybenzo[g]quinoline-3-carbonitrile 1 CHEMBL335025
Type:
Small organic molecule
Emp. Form.:
C24H20ClN3O3
Mol. Mass.:
433.887
SMILES:
COc1cc(Nc2c(cnc3cc4cc(OC)c(OC)cc4cc23)C#N)c(C)cc1Cl
: