Target
Endothelin-1 receptor
Ligand
BDBM50109661
Substrate
Meas. Tech.
ChEBML_65655
Ki
44±n/a nM
Citation
 Murugesan, NGu, ZStein, PDSpergel, SBisaha, SLiu, ECZhang, RWebb, MLMoreland, SBarrish, JC Biphenylsulfonamide endothelin receptor antagonists. Part 3: structure-activity relationship of 4'-heterocyclic biphenylsulfonamides. Bioorg Med Chem Lett 12:517-20 (2002)  
Target
Name:
Endothelin-1 receptor
Synonyms:
EDNRA ET-A ETA-R Endothelin receptor type A hET-AR
Type:
Enzyme Catalytic Domain
Mol. Mass.:
48736.88
Organism:
Homo sapiens (Human)
Description:
P25101
Residue:
427
  
Inhibitor
Name:
BDBM50109661
Synonyms:
4'-(1H-Imidazol-2-yl)-biphenyl-2-sulfonic acid (3,4-dimethyl-isoxazol-5-yl)-amide | CHEMBL148855
Type:
Small organic molecule
Emp. Form.:
C20H18N4O3S
Mol. Mass.:
394.447
SMILES:
Cc1noc(NS(=O)(=O)c2ccccc2-c2ccc(cc2)-c2ncc[nH]2)c1C
: