Target
Reverse transcriptase/RNaseH
Ligand
BDBM50109689
Substrate
Meas. Tech.
ChEMBL_195678 (CHEMBL800750)
IC50
72800±n/a nM
Citation
 Tillekeratne, LMSherette, AFulmer, JAHupe, LHupe, DGabbara, SPeliska, JAHudson, RA Differential inhibition of polymerase and strand-transfer activities of HIV-1 reverse transcriptase. Bioorg Med Chem Lett 12:525-8 (2002)  
Target
Name:
Reverse transcriptase/RNaseH
Synonyms:
HIV-1 Reverse Transcriptase RNase H Reverse transcriptase/RNaseH
Type:
PROTEIN
Mol. Mass.:
65229.15
Organism:
Human immunodeficiency virus 1
Description:
ChEMBL_1473730
Residue:
566
  
Inhibitor
Name:
BDBM50109689
Synonyms:
3,4,5-Trihydroxy-benzoic acid 5,7-dimethoxy-chroman-3-yl ester | CHEMBL151791
Type:
Small organic molecule
Emp. Form.:
C18H18O8
Mol. Mass.:
362.3307
SMILES:
COc1cc(OC)c2CC(COc2c1)OC(=O)c1cc(O)c(O)c(O)c1
: