Target
ATP-dependent translocase ABCB1
Ligand
BDBM50109811
Substrate
Meas. Tech.
ChEBML_64945
IC50
5000±n/a nM
Citation
 Wang, SRyder, HPretswell, IDepledge, PMilton, JHancox, TCDale, IDangerfield, WCharlton, PFaint, RDodd, RHassan, S Studies on quinazolinones as dual inhibitors of Pgp and MRP1 in multidrug resistance. Bioorg Med Chem Lett 12:571-4 (2002)  
Target
Name:
ATP-dependent translocase ABCB1
Synonyms:
ATP-binding cassette sub-family B member 1 Abcb1b MDR1B_MOUSE Mdr1b P-glycoprotein 1 Pgy1 | Pgy1-1
Type:
PROTEIN
Mol. Mass.:
141009.67
Organism:
Mus musculus
Description:
ChEMBL_474396
Residue:
1276
  
Inhibitor
Name:
BDBM50109811
Synonyms:
(S)-1-[2-Oxo-2-(3,4,5-trimethoxy-phenyl)-acetyl]-piperidine-2-carboxylic acid 4-pyridin-3-yl-1-(3-pyridin-3-yl-propyl)-butyl ester CHEMBL350775
Type:
Small organic molecule
Emp. Form.:
C34H41N3O7
Mol. Mass.:
603.7052
SMILES:
COc1cc(cc(OC)c1OC)C(=O)C(=O)N1CCCC[C@H]1C(=O)OC(CCCc1cccnc1)CCCc1cccnc1
: