Target
Protein farnesyltransferase subunit beta/geranylgeranyltransferase type-1 subunit alpha
Ligand
BDBM50109847
Substrate
Meas. Tech.
ChEBML_69830
IC50
38±n/a nM
Citation
 Cooper, ABStrickland, CLWang, JDesai, JKirschmeier, PPatton, RBishop, WRWeber, PCGirijavallabhan, V Synthesis of 5,6-dihydro-11H-benzo[5,6]-cyclohepta[1,2-b]pyridin-11-ylidene)-1-piperidine-N-cyanoguanidine derivatives as inhibitors of ras farnesyl protein transferase. Bioorg Med Chem Lett 12:601-5 (2002)  
Target
Name:
Protein farnesyltransferase subunit beta/geranylgeranyltransferase type-1 subunit alpha
Synonyms:
Farnesyltransferase (FTase) Protein Farnesyltransferase (PFT) Chain B | Protein farnesyltransferase
Type:
Protein Complex
Mol. Mass.:
Description:
To express recombinant enzyme in E. coli, the cloned human alpha and beta subunits were co-expressed from a plasmid, in which their expression was translationally coupled.
Components:
This complex has 2 components.
Component 1
Name:
Protein farnesyltransferase subunit beta
Synonyms:
CAAX farnesyltransferase subunit alpha FNTB FTase-alpha GGTase-I-alpha Protein farnesyl/geranylgeranyl transferase Protein farnesyltransferase subunit beta Protein farnesyltransferase/geranylgeranyltransferase type-1 subunit alpha Ras proteins prenyltransferase subunit beta | Type I protein geranyl-geranyltransferase subunit alpha
Type:
Enzyme Subunit
Mol. Mass.:
48766.02
Organism:
Homo sapiens (Human)
Description:
Protein farnesyltransferase subunit beta
Residue:
437
  
Component 2
Name:
Protein farnesyltransferase/geranylgeranyltransferase type-1 subunit alpha
Synonyms:
CAAX farnesyltransferase alpha subunit FNTA_HUMAN FTase-alpha Geranylgeranyl Transferase (GGTase-I) Chain A Protein Farnesyltransferase (PFT) Chain A Protein farnesyltransferase Protein farnesyltransferase/geranylgeranyltransferase type I alpha subunit | Ras proteins prenyltransferase alpha
Type:
Enzyme
Mol. Mass.:
44392.46
Organism:
Homo sapiens (Human)
Description:
Recombinant human FTase.
Residue:
379
  
Inhibitor
Name:
BDBM50109847
Synonyms:
4-(3-Bromo-8-chloro-5,6-dihydro-benzo[5,6]cyclohepta[1,2-b]pyridin-11-ylidene)-N-(4-fluoro-phenyl)-N'-cyano-piperidine-1-carboxamidine | CHEMBL347798
Type:
Small organic molecule
Emp. Form.:
C27H22BrClFN5
Mol. Mass.:
550.852
SMILES:
Fc1ccc(-[#7]-[#6](=[#7]C#N)-[#7]-2-[#6]-[#6]\[#6](-[#6]-[#6]-2)=[#6]-2\c3ccc(Cl)cc3-[#6]-[#6]-c3cc(Br)cnc-23)cc1
: