Target
Histamine H3 receptor
Ligand
BDBM50110288
Substrate
Meas. Tech.
ChEMBL_85818 (CHEMBL697095)
Ki
0.091±n/a nM
Citation
 Apelt, JLigneau, XPertz, HHArrang, JMGanellin, CRSchwartz, JCSchunack, WStark, H Development of a new class of nonimidazole histamine H(3) receptor ligands with combined inhibitory histamine N-methyltransferase activity. J Med Chem 45:1128-41 (2002)  
Target
Name:
Histamine H3 receptor
Synonyms:
G-protein coupled receptor 97 HH3R HRH3 Histamine H3 receptor (H3) Histamine receptor (H3 and H4)
Type:
G Protein-Coupled Receptor (GPCR)
Mol. Mass.:
48691.47
Organism:
Homo sapiens (Human)
Description:
Binding assays were using CHO cells stably expressing hH3R receptors.
Residue:
445
  
Inhibitor
Name:
BDBM50110288
Synonyms:
CHEMBL15153 [4-(3-Piperidin-1-yl-propoxy)-phenyl]-quinolin-4-yl-amine; Oxalic acid
Type:
Small organic molecule
Emp. Form.:
C23H27N3O
Mol. Mass.:
361.48
SMILES:
C(COc1ccc(Nc2ccnc3ccccc23)cc1)CN1CCCCC1
: