Target
Muscarinic acetylcholine receptor M2
Ligand
BDBM50110526
Substrate
Meas. Tech.
ChEBML_139772
Ki
16±n/a nM
Citation
 Kozlowski, JAZhou, GTagat, JRLin, SIMcCombie, SWRuperto, VBDuffy, RAMcQuade, RACrosby, GTaylor, LABillard, WBinch, HLachowicz, JE Substituted 2-(R)-methyl piperazines as muscarinic M(2) selective ligands. Bioorg Med Chem Lett 12:791-4 (2002)  
Target
Name:
Muscarinic acetylcholine receptor M2
Synonyms:
ACM2_HUMAN Cholinergic, muscarinic M2 Muscarinic acetylcholine receptor M2 and M5 | RecName: Full=Muscarinic acetylcholine receptor M2
Type:
GPCR
Mol. Mass.:
51730.61
Organism:
Homo sapiens (Human)
Description:
P08172
Residue:
466
  
Inhibitor
Name:
BDBM50110526
Synonyms:
(4-Cyclohexyl-2-methyl-piperazin-1-yl)-[4-(4-methoxy-benzenesulfonyl)-phenyl]-acetonitrile | CHEMBL352607
Type:
Small organic molecule
Emp. Form.:
C26H33N3O3S
Mol. Mass.:
467.624
SMILES:
COc1ccc(cc1)S(=O)(=O)c1ccc(cc1)C(C#N)N1CCN(C[C@@H]1C)C1CCCCC1
: