Target
Muscarinic acetylcholine receptor M2
Ligand
BDBM50110560
Substrate
Meas. Tech.
ChEBML_139764
Ki
1±n/a nM
Citation
 McCombie, SWLin, SITagat, JRNazareno, DVice, SFord, JAsberom, TLeone, DKozlowski, JAZhou, GRuperto, VBDuffy, RALachowicz, JE Synthesis and structure-activity relationships of M(2)-selective muscarinic receptor ligands in the 1-[4-(4-arylsulfonyl)-phenylmethyl]-4-(4-piperidinyl)-piperazine family. Bioorg Med Chem Lett 12:795-8 (2002)  
Target
Name:
Muscarinic acetylcholine receptor M2
Synonyms:
ACM2_HUMAN Cholinergic, muscarinic M2 Muscarinic acetylcholine receptor M2 and M5 | RecName: Full=Muscarinic acetylcholine receptor M2
Type:
GPCR
Mol. Mass.:
51730.61
Organism:
Homo sapiens (Human)
Description:
P08172
Residue:
466
  
Inhibitor
Name:
BDBM50110560
Synonyms:
CHEMBL165434 | [4-((R)-4-{(S)-1-[4-(Benzo[1,3]dioxole-5-sulfonyl)-phenyl]-ethyl}-3-methyl-piperazin-1-yl)-piperidin-1-yl]-(2-hydroxy-phenyl)-methanone
Type:
Small organic molecule
Emp. Form.:
C32H37N3O6S
Mol. Mass.:
591.718
SMILES:
C[C@H](N1CCN(C[C@H]1C)C1CCN(CC1)C(=O)c1ccccc1O)c1ccc(cc1)S(=O)(=O)c1ccc2OCOc2c1
: