Target
Adenosine receptor A2b
Ligand
BDBM50110991
Substrate
Meas. Tech.
ChEMBL_30604 (CHEMBL642011)
Ki
6.1±n/a nM
Citation
 Hayallah, AMSandoval-Ramírez, JReith, USchobert, UPreiss, BSchumacher, BDaly, JWMüller, CE 1,8-disubstituted xanthine derivatives: synthesis of potent A2B-selective adenosine receptor antagonists. J Med Chem 45:1500-10 (2002)  
Target
Name:
Adenosine receptor A2b
Synonyms:
AA2BR_HUMAN ADORA2B Adenosine receptors A2b | Adenosine receptors; A2a & A2b
Type:
G Protein-Coupled Receptor (GPCR)
Mol. Mass.:
36341.22
Organism:
Homo sapiens (Human)
Description:
Residue:
332
  
Inhibitor
Name:
BDBM50110991
Synonyms:
4-{2-[4-(1-Butyl-2,6-dioxo-2,3,6,7-tetrahydro-1H-purin-8-yl)-phenoxy]-acetyl}-piperazine-1-carboxylic acid ethyl ester | CHEMBL37933
Type:
Small organic molecule
Emp. Form.:
C24H30N6O6
Mol. Mass.:
498.5316
SMILES:
CCCCn1c(=O)[nH]c2nc([nH]c2c1=O)-c1ccc(OCC(=O)N2CCN(CC2)C(=O)OCC)cc1
: