Target
Adenosine receptor A2a
Ligand
BDBM50110992
Substrate
Meas. Tech.
ChEMBL_30137 (CHEMBL641340)
Ki
550±n/a nM
Citation
 Hayallah, AMSandoval-Ramírez, JReith, USchobert, UPreiss, BSchumacher, BDaly, JWMüller, CE 1,8-disubstituted xanthine derivatives: synthesis of potent A2B-selective adenosine receptor antagonists. J Med Chem 45:1500-10 (2002)  
Target
Name:
Adenosine receptor A2a
Synonyms:
AA2AR_RAT Adenosine A2 receptor Adenosine Receptors A2a (A2a) Adenosine receptors A2a Rat striatal adenosine A2a receptor
Type:
G Protein-Coupled Receptor (GPCR)
Mol. Mass.:
45015.65
Organism:
Rattus norvegicus (rat)
Description:
Rat A2A receptors expressed in CHO cells.
Residue:
410
  
Inhibitor
Name:
BDBM50110992
Synonyms:
8-{4-[2-(4-Benzyl-piperazin-1-yl)-2-oxo-ethoxy]-phenyl}-1-butyl-3,7-dihydro-purine-2,6-dione | CHEMBL38304
Type:
Small organic molecule
Emp. Form.:
C28H32N6O4
Mol. Mass.:
516.5915
SMILES:
CCCCn1c(=O)[nH]c2nc([nH]c2c1=O)-c1ccc(OCC(=O)N2CCN(Cc3ccccc3)CC2)cc1
: