Target
Adenosine receptor A1
Ligand
BDBM50110983
Substrate
Meas. Tech.
ChEMBL_29625 (CHEMBL636643)
Ki
30±n/a nM
Citation
 Hayallah, AMSandoval-Ramírez, JReith, USchobert, UPreiss, BSchumacher, BDaly, JWMüller, CE 1,8-disubstituted xanthine derivatives: synthesis of potent A2B-selective adenosine receptor antagonists. J Med Chem 45:1500-10 (2002)  
Target
Name:
Adenosine receptor A1
Synonyms:
AA1R_RAT ADENOSINE A1 high Adenosine A1 receptor (A1) Adenosine receptors A1 | Adora1
Type:
Protein
Mol. Mass.:
36704.13
Organism:
Rattus norvegicus (rat)
Description:
Residue:
326
  
Inhibitor
Name:
BDBM50110983
Synonyms:
8-{4-[2-(4-Acetyl-piperazin-1-yl)-2-oxo-ethoxy]-phenyl}-1-butyl-3,7-dihydro-purine-2,6-dione | CHEMBL37050
Type:
Small organic molecule
Emp. Form.:
C23H28N6O5
Mol. Mass.:
468.5056
SMILES:
CCCCn1c(=O)[nH]c2nc([nH]c2c1=O)-c1ccc(OCC(=O)N2CCN(CC2)C(C)=O)cc1
: