Target
Peroxisome proliferator-activated receptor gamma/Retinoic acid receptor RXR-alpha
Ligand
BDBM50111009
Substrate
Meas. Tech.
ChEMBL_43804 (CHEMBL656374)
EC50
119±n/a nM
Citation
 Momose, YMaekawa, TYamano, TKawada, MOdaka, HIkeda, HSohda, T Novel 5-substituted 2,4-thiazolidinedione and 2,4-oxazolidinedione derivatives as insulin sensitizers with antidiabetic activities. J Med Chem 45:1518-34 (2002)  
Target
Name:
Peroxisome proliferator-activated receptor gamma/Retinoic acid receptor RXR-alpha
Synonyms:
Peroxisome Proliferator-Activated Receptor gamma/Retinoid X receptor alpha | RXR alpha/PPAR gamma
Type:
Mol. Mass.:
Description:
ASSAY_ID of EBI is 43803
Components:
This complex has 3 components.
Component 1
Name:
Peroxisome proliferator-activated receptor gamma
Synonyms:
NR1C3 PPAR-gamma PPARG_HUMAN Peroxisome proliferator-activated receptor gamma (PPAR gamma) Peroxisome proliferator-activated receptor gamma (PPARĪ³) peroxisome proliferator-activated receptor gamma isoform 2
Type:
Nuclear Receptor
Mol. Mass.:
57613.46
Organism:
Homo sapiens (Human)
Description:
P37231
Residue:
505
  
Component 2
Name:
Retinoic acid receptor RXR-alpha
Synonyms:
NR2B1 Nuclear receptor subfamily 4 group A member 2 RXRA Retinoic acid receptor RXR-alpha/gamma Retinoid receptor
Type:
PROTEIN
Mol. Mass.:
50820.38
Organism:
Homo sapiens (Human)
Description:
ChEMBL_1456363
Residue:
462
  
Inhibitor
Name:
BDBM50111009
Synonyms:
5-{3-[4-(5-Methyl-2-phenyl-oxazol-4-ylmethoxy)-phenyl]-propyl}-oxazolidine-2,4-dione | CHEMBL36991
Type:
Small organic molecule
Emp. Form.:
C23H22N2O5
Mol. Mass.:
406.4312
SMILES:
Cc1oc(nc1COc1ccc(CCCc2oc(=O)[nH]c2O)cc1)-c1ccccc1
: