Target
Neuropeptide Y receptor type 5
Ligand
BDBM50111079
Substrate
Meas. Tech.
ChEBML_143997
IC50
2.3±n/a nM
Citation
 Satoh, YHatori, CIto, H Novel potent antagonists of human neuropeptide Y-Y5 receptor. Part 4: tetrahydrodiazabenzazulene derivatives. Bioorg Med Chem Lett 12:1009-11 (2002)  
Target
Name:
Neuropeptide Y receptor type 5
Synonyms:
NPY-Y5 NPY5-R NPY5R_HUMAN NPYY5 Neuropeptide Y receptor type 5 ( NPY Y5) | Y5 receptor
Type:
Enzyme
Mol. Mass.:
50746.64
Organism:
Homo sapiens (Human)
Description:
Q15761
Residue:
445
  
Inhibitor
Name:
BDBM50111079
Synonyms:
9-Methyl-2-pyridin-3-yl-3,4,5,6-tetrahydro-1,3-diaza-benzo[e]azulene | CHEMBL7342
Type:
Small organic molecule
Emp. Form.:
C18H17N3
Mol. Mass.:
275.3477
SMILES:
Cc1ccc2CCCc3[nH]c(nc3-c2c1)-c1cccnc1
: