Target
Prostaglandin G/H synthase 2
Ligand
BDBM50088679
Substrate
Meas. Tech.
ChEMBL_157994 (CHEMBL766667)
IC50
<1±n/a nM
Citation
 Noguchi, TShimazawa, RNagasawa, KHashimoto, Y Thalidomide and its analogues as cyclooxygenase inhibitors. Bioorg Med Chem Lett 12:1043-6 (2002)  
Target
Name:
Prostaglandin G/H synthase 2
Synonyms:
COX2 Cyclooxygenase-2 (COX-2) PTGS2 Prostaglandin G/H synthase (cyclooxygenase)
Type:
Protein
Mol. Mass.:
68976.98
Organism:
Ovis aries (Sheep)
Description:
Residue:
603
  
Inhibitor
Name:
BDBM50088679
Synonyms:
2-Phenyl-isoindole-1,3-dione 2-phenylisoindoline-1,3-dione N-Phenylphtalimide
Type:
Small organic molecule
Emp. Form.:
C14H9NO2
Mol. Mass.:
223.2268
SMILES:
O=C1N(C(=O)c2ccccc12)c1ccccc1
: