Target
DNA polymerase I, thermostable
Ligand
BDBM50111323
Substrate
Meas. Tech.
ChEBML_209735
IC50
2200±n/a nM
Citation
 Alberti, PSchmitt, PNguyen, CHRivalle, CHoarau, MGrierson, DSMergny, JL Benzoindoloquinolines interact with DNA tetraplexes and inhibit telomerase. Bioorg Med Chem Lett 12:1071-4 (2002)  
Target
Name:
DNA polymerase I, thermostable
Synonyms:
DNA polymerase I, thermostable Taq polymerase 1 polA
Type:
PROTEIN
Mol. Mass.:
93906.95
Organism:
Thermus aquaticus
Description:
ChEMBL_1289218
Residue:
832
  
Inhibitor
Name:
BDBM50111323
Synonyms:
CHEMBL276202 | N'-(11-Methoxy-13H-5,13-diaza-dibenzo[a,i]fluoren-6-yl)-N,N-dimethyl-propane-1,3-diamine
Type:
Small organic molecule
Emp. Form.:
C25H26N4O
Mol. Mass.:
398.5001
SMILES:
COc1ccc2ccc3c([nH]c4c3c(NCCCN(C)C)nc3ccccc43)c2c1
: