Target
Muscarinic acetylcholine receptor M2
Ligand
BDBM50111357
Substrate
Meas. Tech.
ChEBML_139766
Ki
134±n/a nM
Citation
 Wang, YChackalamannil, SHu, ZMcKittrick, BAGreenlee, WRuperto, VDuffy, RALachowicz, JE Sulfide analogues as potent and selective M(2) muscarinic receptor antagonists. Bioorg Med Chem Lett 12:1087-91 (2002)  
Target
Name:
Muscarinic acetylcholine receptor M2
Synonyms:
ACM2_HUMAN Cholinergic, muscarinic M2 Muscarinic acetylcholine receptor M2 and M5 | RecName: Full=Muscarinic acetylcholine receptor M2
Type:
GPCR
Mol. Mass.:
51730.61
Organism:
Homo sapiens (Human)
Description:
P08172
Residue:
466
  
Inhibitor
Name:
BDBM50111357
Synonyms:
CHEMBL269645 | [4-(4-Isopropylsulfanyl-benzyl)-[1,4']bipiperidinyl-1'-yl]-isoxazol-5-yl-methanone
Type:
Small organic molecule
Emp. Form.:
C24H33N3O2S
Mol. Mass.:
427.603
SMILES:
CC(C)Sc1ccc(CC2CCN(CC2)C2CCN(CC2)C(=O)c2ccno2)cc1
: