Target
Tubulin beta-2B chain
Ligand
BDBM50111559
Substrate
Meas. Tech.
ChEMBL_225810 (CHEMBL845250)
IC50
31000±n/a nM
Citation
 Wang, LWoods, KWLi, QBarr, KJMcCroskey, RWHannick, SMGherke, LCredo, RBHui, YHMarsh, KWarner, RLee, JYZielinski-Mozng, NFrost, DRosenberg, SHSham, HL Potent, orally active heterocycle-based combretastatin A-4 analogues: synthesis, structure-activity relationship, pharmacokinetics, and in vivo antitumor activity evaluation. J Med Chem 45:1697-711 (2002)  
Target
Name:
Tubulin beta-2B chain
Synonyms:
TBB2B_BOVIN Tubulin | Tubulin beta chain
Type:
PROTEIN
Mol. Mass.:
49932.38
Organism:
Bos taurus
Description:
ChEMBL_211651
Residue:
445
  
Inhibitor
Name:
BDBM50111559
Synonyms:
2-Methoxy-5-[3-methyl-5-(3,4,5-trimethoxy-phenyl)-3H-imidazol-4-yl]-phenylamine | CHEMBL46215
Type:
Small organic molecule
Emp. Form.:
C20H23N3O4
Mol. Mass.:
369.4143
SMILES:
COc1ccc(cc1N)-c1c(ncn1C)-c1cc(OC)c(OC)c(OC)c1
: