Target
5-hydroxytryptamine receptor 1A
Ligand
BDBM50111631
Substrate
Meas. Tech.
ChEBML_1161
Ki
4±n/a nM
Citation
 Mouithys-Mickalad, APoupaert, JHSpampinato, SLesieur, D Synthesis and pharmacological evaluation of 6-piperidino- and 6-piperazinoalkyl-2(3H)-benzothiazolones as mixed sigma/5-HT(1A) ligands. Bioorg Med Chem Lett 12:1149-52 (2002)  
Target
Name:
5-hydroxytryptamine receptor 1A
Synonyms:
5-HT-1A 5-HT1A 5-hydroxytryptamine receptor 1A (5HT1A) 5ht1a Htr1a Serotonin 1a (5-HT1a) receptor/Adrenergic receptor alpha-1 | Serotonin receptor 1A
Type:
G Protein-Coupled Receptor (GPCR)
Mol. Mass.:
46445.29
Organism:
Rattus norvegicus (rat)
Description:
Binding assays were performed using rat hippocampal membranes.
Residue:
422
  
Inhibitor
Name:
BDBM50111631
Synonyms:
6-[2-(4-Benzyl-piperidin-1-yl)-ethyl]-3-methyl-3H-benzothiazol-2-one | CHEMBL15809
Type:
Small organic molecule
Emp. Form.:
C22H26N2OS
Mol. Mass.:
366.52
SMILES:
Cn1c2ccc(CCN3CCC(Cc4ccccc4)CC3)cc2sc1=O
: