Target
Acetylcholine receptor subunit delta
Ligand
BDBM50111636
Substrate
Meas. Tech.
ChEMBL_142596 (CHEMBL750562)
IC50
9760±n/a nM
Citation
 Strømgaard, KMellor, IRAndersen, KNeagoe, IPluteanu, FUsherwood, PNKrogsgaard-Larsen, PJaroszewski, JW Solid-phase synthesis and pharmacological evaluation of analogues of PhTX-12-A potent and selective nicotinic acetylcholine receptor antagonist. Bioorg Med Chem Lett 12:1159-62 (2002)  
Target
Name:
Acetylcholine receptor subunit delta
Synonyms:
ACHD_HUMAN Acetylcholine receptor protein delta chain Muscle-type nicotinic acetylcholine receptor | Nicotinic acetylcholine receptor alpha-1/beta-1/delta/epsilon
Type:
PROTEIN
Mol. Mass.:
58894.39
Organism:
Homo sapiens (Human)
Description:
ChEMBL_142595
Residue:
517
  
Inhibitor
Name:
BDBM50111636
Synonyms:
CHEMBL16259 | N-[(S)-1-(8-Amino-octylcarbamoyl)-2-(4-hydroxy-phenyl)-ethyl]-butyramide
Type:
Small organic molecule
Emp. Form.:
C21H35N3O3
Mol. Mass.:
377.5209
SMILES:
CCCC(=O)N[C@@H](Cc1ccc(O)cc1)C(=O)NCCCCCCCCN
: