Target
Bone morphogenetic protein 1
Ligand
BDBM50111815
Substrate
Meas. Tech.
ChEBML_158892
IC50
26±n/a nM
Citation
 Dankwardt, SMAbbot, SCBroka, CAMartin, RLChan, CSSpringman, EBVan Wart, HEWalker, KA Amino acid derived sulfonamide hydroxamates as inhibitors of procollagen C-proteinase. Part 2: Solid-phase optimization of side chains. Bioorg Med Chem Lett 12:1233-5 (2002)  
Target
Name:
Bone morphogenetic protein 1
Synonyms:
BMP-1 BMP1_HUMAN PCOLC Procollagen C-proteinase | mTld
Type:
PROTEIN
Mol. Mass.:
111254.03
Organism:
Homo sapiens (Human)
Description:
ChEMBL_518962
Residue:
986
  
Inhibitor
Name:
BDBM50111815
Synonyms:
4-{(R)-[Benzo[1,3]dioxol-5-ylmethyl-(4-methoxy-benzenesulfonyl)-amino]-carboxy-methyl}-piperidine-1-carboxylic acid tert-butyl ester | CHEMBL21593
Type:
Small organic molecule
Emp. Form.:
C27H34N2O9S
Mol. Mass.:
562.632
SMILES:
COc1ccc(cc1)S(=O)(=O)N(Cc1ccc2OCOc2c1)[C@H](C1CCN(CC1)C(=O)OC(C)(C)C)C(O)=O
: