Target
Bone morphogenetic protein 1
Ligand
BDBM50111840
Substrate
Meas. Tech.
ChEMBL_158889 (CHEMBL760877)
IC50
6±n/a nM
Citation
 Dankwardt, SMAbbot, SCBroka, CAMartin, RLChan, CSSpringman, EBVan Wart, HEWalker, KA Amino acid derived sulfonamide hydroxamates as inhibitors of procollagen C-proteinase. Part 2: Solid-phase optimization of side chains. Bioorg Med Chem Lett 12:1233-5 (2002)  
Target
Name:
Bone morphogenetic protein 1
Synonyms:
BMP-1 BMP1_HUMAN PCOLC Procollagen C-proteinase | mTld
Type:
PROTEIN
Mol. Mass.:
111254.03
Organism:
Homo sapiens (Human)
Description:
ChEMBL_518962
Residue:
986
  
Inhibitor
Name:
BDBM50111840
Synonyms:
(R)-N-Hydroxy-2-[(4-methoxy-benzenesulfonyl)-(2-trifluoromethyl-benzyl)-amino]-propionamide | CHEMBL20787
Type:
Small organic molecule
Emp. Form.:
C18H19F3N2O5S
Mol. Mass.:
432.414
SMILES:
COc1ccc(cc1)S(=O)(=O)N(Cc1ccccc1C(F)(F)F)[C@H](C)C(=O)NO
: