Target
Bone morphogenetic protein 1
Ligand
BDBM50111857
Substrate
Meas. Tech.
ChEBML_158892
IC50
24±n/a nM
Citation
 Dankwardt, SMAbbot, SCBroka, CAMartin, RLChan, CSSpringman, EBVan Wart, HEWalker, KA Amino acid derived sulfonamide hydroxamates as inhibitors of procollagen C-proteinase. Part 2: Solid-phase optimization of side chains. Bioorg Med Chem Lett 12:1233-5 (2002)  
Target
Name:
Bone morphogenetic protein 1
Synonyms:
BMP-1 BMP1_HUMAN PCOLC Procollagen C-proteinase | mTld
Type:
PROTEIN
Mol. Mass.:
111254.03
Organism:
Homo sapiens (Human)
Description:
ChEMBL_518962
Residue:
986
  
Inhibitor
Name:
BDBM50111857
Synonyms:
(R)-2-[Benzo[1,3]dioxol-5-ylmethyl-(4-methoxy-benzenesulfonyl)-amino]-3-thiophen-2-yl-propionic acid | CHEMBL265063
Type:
Small organic molecule
Emp. Form.:
C22H21NO7S2
Mol. Mass.:
475.535
SMILES:
COc1ccc(cc1)S(=O)(=O)N(Cc1ccc2OCOc2c1)[C@H](Cc1cccs1)C(O)=O
: