Target
Adenosine kinase
Ligand
BDBM50090843
Substrate
Meas. Tech.
ChEMBL_31119 (CHEMBL643547)
IC50
0.200000±n/a nM
Citation
 Srikanth, KDebnath, BJha, T QSAR study on adenosine kinase inhibition of pyrrolo[2,3-d]pyrimidine nucleoside analogues using the hansch approach. Bioorg Med Chem Lett 12:899-902 (2002)  
Target
Name:
Adenosine kinase
Synonyms:
ADK | ADK_HUMAN
Type:
PROTEIN
Mol. Mass.:
40545.97
Organism:
Homo sapiens (Human)
Description:
ChEMBL_1467841
Residue:
362
  
Inhibitor
Name:
BDBM50090843
Synonyms:
(1R,5S)-2-((3R,4aR)-4-Amino-5-bromo-pyrrolo[2,3-d]pyrimidin-7-yl)-5-aminomethyl-tetrahydro-furan-3,4-diol 2-(4-Amino-5-bromo-pyrrolo[2,3-d]pyrimidin-7-yl)-5-aminomethyl-tetrahydro-furan-3,4-diol | CHEMBL99707
Type:
Small organic molecule
Emp. Form.:
C11H14BrN5O3
Mol. Mass.:
344.165
SMILES:
NC[C@H]1O[C@H]([C@H](O)[C@@H]1O)n1cc(Br)c2c(N)ncnc12
: