Target
Ribosyldihydronicotinamide dehydrogenase [quinone]
Ligand
BDBM50112205
Substrate
Meas. Tech.
ChEMBL_104942 (CHEMBL713109)
Ki
1000±n/a nM
Citation
 Leclerc, VYous, SDelagrange, PBoutin, JARenard, PLesieur, D Synthesis of nitroindole derivatives with high affinity and selectivity for melatoninergic binding sites MT(3). J Med Chem 45:1853-9 (2002)  
Target
Name:
Ribosyldihydronicotinamide dehydrogenase [quinone]
Synonyms:
Metallothionein-3 NQO2 NRH dehydrogenase [quinone] 2 QR2 Quinone reductase 2 (NQO2) | Ribosyldihydronicotinamide dehydrogenase [quinone]
Type:
Protein
Mol. Mass.:
25917.25
Organism:
Homo sapiens (Human)
Description:
P16083
Residue:
231
  
Inhibitor
Name:
BDBM50112205
Synonyms:
CHEMBL298335 | N-[2-(5-Methoxy-6-nitro-1H-indol-3-yl)-ethyl]-acetamide
Type:
Small organic molecule
Emp. Form.:
C13H15N3O4
Mol. Mass.:
277.2759
SMILES:
COc1cc2c(CCNC(C)=O)c[nH]c2cc1[N+]([O-])=O
: