Target
Gamma-aminobutyric acid receptor subunit alpha-3/beta-3/gamma-2
Ligand
BDBM50065229
Substrate
Meas. Tech.
ChEMBL_70417 (CHEMBL682252)
Ki
4±n/a nM
Citation
 Collins, IMoyes, CDavey, WBRowley, MBromidge, FAQuirk, KAtack, JRMcKernan, RMThompson, SAWafford, KDawson, GRPike, ASohal, BTsou, NNBall, RGCastro, JL 3-Heteroaryl-2-pyridones: benzodiazepine site ligands with functional delectivity for alpha 2/alpha 3-subtypes of human GABA(A) receptor-ion channels. J Med Chem 45:1887-900 (2002)  
Target
Name:
Gamma-aminobutyric acid receptor subunit alpha-3/beta-3/gamma-2
Synonyms:
GABA receptor alpha-3/beta-3/gamma-2 subunit | GABA-A receptor; alpha-3/beta-3/gamma-2
Type:
Mol. Mass.:
Description:
ASSAY_ID of EBI is 68410
Components:
This complex has 3 components.
Component 1
Name:
Gamma-aminobutyric acid receptor subunit gamma-2
Synonyms:
GABA(A) receptor subunit gamma-2 GBRG2_HUMAN
Type:
PROTEIN
Mol. Mass.:
54172.74
Organism:
Homo sapiens (Human)
Description:
EBI_217
Residue:
467
  
Component 2
Name:
Gamma-aminobutyric acid receptor subunit beta-3
Synonyms:
GABA A receptor alpha-4/beta-3/gamma-2 GABA-A receptor GBRB3_HUMAN | agonist GABA site
Type:
PROTEIN
Mol. Mass.:
54130.51
Organism:
Homo sapiens (Human)
Description:
ChEMBL_448071
Residue:
473
  
Component 3
Name:
Gamma-aminobutyric acid receptor subunit alpha-3
Synonyms:
GABA A Alpha3Beta3Gamma2 GABA C GABA-A receptor GBRA3_HUMAN agonist GABA site
Type:
Enzyme Catalytic Domain
Mol. Mass.:
55175.47
Organism:
Homo sapiens (Human)
Description:
GABA A Alpha3Beta1Gamma2 0 HUMAN::P34903
Residue:
492
  
Inhibitor
Name:
BDBM50065229
Synonyms:
4-Ethyl-6,7-dimethoxy-9H-beta-carboline-3-carboxylic acid methyl ester 4-Ethyl-6,7-dimethoxy-9H-carbazole-3-carboxylic acid methyl ester | CHEMBL17468
Type:
Small organic molecule
Emp. Form.:
C17H18N2O4
Mol. Mass.:
314.3358
SMILES:
CCc1c([nH]cc2nc3cc(OC)c(OC)cc3c12)C(=O)OC
: