Target
G-protein coupled bile acid receptor 1
Ligand
BDBM50300199
Substrate
Meas. Tech.
ChEMBL_2035145 (CHEMBL4689303)
EC50
132±n/a nM
Citation
 Zhao, SLi, XWang, LPeng, WYe, WLi, WWang, YDChen, WD Design, synthesis and evaluation of 1-benzyl-1H-imidazole-5-carboxamide derivatives as potent TGR5 agonists. Bioorg Med Chem 32:0 (2021)  
Target
Name:
G-protein coupled bile acid receptor 1
Synonyms:
GPBAR_MOUSE M-BAR Tgr5
Type:
PROTEIN
Mol. Mass.:
35665.78
Organism:
Mus musculus
Description:
ChEMBL_1475560
Residue:
329
  
Inhibitor
Name:
BDBM50300199
Synonyms:
6alpha-ethyl-23(S)-methyl-cholic acid | CHEMBL567640
Type:
Small organic molecule
Emp. Form.:
C27H46O5
Mol. Mass.:
450.6511
SMILES:
CC[C@H]1[C@@H](O)[C@H]2[C@@H]3CC[C@H]([C@H](C)C[C@H](C)C(O)=O)[C@@]3(C)[C@@H](O)C[C@@H]2[C@@]2(C)CC[C@@H](O)C[C@@H]12
: