Target
Coagulation factor X
Ligand
BDBM50112513
Substrate
Meas. Tech.
ChEBML_49327
Ki
0.100000±n/a nM
Citation
 Shaw, KJGuilford, WJGriedel, BDSakata, STrinh, LWu, SXu, WZhao, ZMorrissey, MM Benzimidazole-based fXa inhibitors with improved thrombin and trypsin selectivity. Bioorg Med Chem Lett 12:1311-4 (2002)  
Target
Name:
Coagulation factor X
Synonyms:
Activated coagulation factor X (FXa) Coagulation factor X precursor F10 Factor X heavy chain Factor Xa Stuart-Prower factor
Type:
Enzyme
Mol. Mass.:
54726.60
Organism:
Homo sapiens (Human)
Description:
Residue:
488
  
Inhibitor
Name:
BDBM50112513
Synonyms:
4-Amino-2-(3-{2-ethyl-5-[1-(1-imino-ethyl)-piperidin-4-yloxy]-benzoimidazol-1-yl}-propenyl)-phenol | CHEMBL25068
Type:
Small organic molecule
Emp. Form.:
C25H31N5O2
Mol. Mass.:
433.5459
SMILES:
CCc1nc2cc(OC3CCN(CC3)C(C)=N)ccc2n1CC=Cc1cc(N)ccc1O
: