Target
Prostaglandin G/H synthase 2
Ligand
BDBM22571
Substrate
Meas. Tech.
ChEMBL_157840 (CHEMBL768580)
IC50
220000±n/a nM
Citation
 Kozak, KRPrusakiewicz, JJRowlinson, SWMarnett, LJ Enantiospecific, selective cyclooxygenase-2 inhibitors. Bioorg Med Chem Lett 12:1315-8 (2002)  
Target
Name:
Prostaglandin G/H synthase 2
Synonyms:
Cox-2 Cyclooxygenase-2 Glucocorticoid-regulated inflammatory cyclooxygenase Macrophage activation-associated marker protein P71/73 PGH synthase 2 PGHS-2 Pghs-b Prostaglandin H2 synthase 2 Ptgs2 Tis10
Type:
Protein
Mol. Mass.:
69020.39
Organism:
Mus musculus (Mouse)
Description:
Q05769
Residue:
604
  
Inhibitor
Name:
BDBM22571
Synonyms:
2-{1-[(4-chlorophenyl)carbonyl]-5-methoxy-2-methyl-1H-indol-3-yl}-N-[(2S)-1-hydroxypropan-2-yl]acetamide alpha-substituted indomethacin ethanolamide, 7
Type:
Small organic molecule
Emp. Form.:
C22H23ClN2O4
Mol. Mass.:
414.882
SMILES:
COc1ccc2n(C(=O)c3ccc(Cl)cc3)c(C)c(CC(=O)N[C@@H](C)CO)c2c1
: