Target
Genome polyprotein
Ligand
BDBM50112652
Substrate
Meas. Tech.
ChEMBL_161092 (CHEMBL771553)
EC50
630±n/a nM
Citation
 Johnson, TOHua, YLuu, HTBrown, ELChan, FChu, SSDragovich, PSEastman, BWFerre, RAFuhrman, SAHendrickson, TFMaldonado, FCMatthews, DAMeador, JWPatick, AKReich, SHSkalitzky, DJWorland, STYang, MZalman, LS Structure-based design of a parallel synthetic array directed toward the discovery of irreversible inhibitors of human rhinovirus 3C protease. J Med Chem 45:2016-23 (2002)  
Target
Name:
Genome polyprotein
Synonyms:
Human rhinovirus A protease | Human rhinovirus B 3A protease
Type:
PROTEIN
Mol. Mass.:
44361.04
Organism:
Human rhinovirus B
Description:
ChEMBL_158953
Residue:
401
  
Inhibitor
Name:
BDBM50112652
Synonyms:
4-[3-(3-Bromo-4-fluoro-phenyl)-acryloylamino]-5-(2-oxo-pyrrolidin-3-yl)-pent-2-enoic acid ethyl ester | CHEMBL305323
Type:
Small organic molecule
Emp. Form.:
C20H22BrFN2O4
Mol. Mass.:
453.302
SMILES:
CCOC(=O)\C=C\[C@H](C[C@@H]1CCNC1=O)NC(=O)\C=C\c1ccc(F)c(Br)c1
: