Target
Oxytocin receptor
Ligand
BDBM50219760
Substrate
Meas. Tech.
ChEMBL_149054 (CHEMBL761408)
Ki
0.501187±n/a nM
Citation
 Wyatt, PGAllen, MJChilcott, JGardner, CJLivermore, DGMordaunt, JENerozzi, FPatel, MPerren, MJWeingarten, GGShabbir, SWoollard, PMZhou, P Identification of potent and selective oxytocin antagonists. Part 2: further investigation of benzofuran derivatives. Bioorg Med Chem Lett 12:1405-11 (2002)  
Target
Name:
Oxytocin receptor
Synonyms:
OT-R OXYR_HUMAN | Oxytocin
Type:
Enzyme Catalytic Domain
Mol. Mass.:
42793.26
Organism:
Homo sapiens (Human)
Description:
Oxytocin OXTR HEK293::B2R9L7
Residue:
389
  
Inhibitor
Name:
BDBM50219760
Synonyms:
CHEMBL286895
Type:
Small organic molecule
Emp. Form.:
C33H34N6O7
Mol. Mass.:
626.6591
SMILES:
O=C(Cn1ccc(nc1=O)N1CCOCC1)NCc1cc2cc(ccc2o1)C(=O)N1CCC(CC1)N1C(=O)OCc2ccccc12
: