Target
Adenosine receptor A2a
Ligand
BDBM50113239
Substrate
Meas. Tech.
ChEMBL_29994 (CHEMBL642182)
Ki
16700±n/a nM
Citation
 Kim, SAMarshall, MAMelman, NKim, HSMüller, CELinden, JJacobson, KA Structure-activity relationships at human and rat A2B adenosine receptors of xanthine derivatives substituted at the 1-, 3-, 7-, and 8-positions. J Med Chem 45:2131-8 (2002)  
Target
Name:
Adenosine receptor A2a
Synonyms:
AA2AR_RAT Adenosine A2 receptor Adenosine Receptors A2a (A2a) Adenosine receptors A2a Rat striatal adenosine A2a receptor
Type:
G Protein-Coupled Receptor (GPCR)
Mol. Mass.:
45015.65
Organism:
Rattus norvegicus (rat)
Description:
Rat A2A receptors expressed in CHO cells.
Residue:
410
  
Inhibitor
Name:
BDBM50113239
Synonyms:
7-(2-Chloro-ethyl)-8-phenyl-1,3-dipropyl-3,7-dihydro-purine-2,6-dione | CHEMBL307105
Type:
Small organic molecule
Emp. Form.:
C19H23ClN4O2
Mol. Mass.:
374.865
SMILES:
CCCn1c2nc(-c3ccccc3)n(CCCl)c2c(=O)n(CCC)c1=O
: