Target
Cathepsin S
Ligand
BDBM50113663
Substrate
Meas. Tech.
ChEMBL_48669 (CHEMBL658340)
IC50
1200±n/a nM
Citation
 Altmann, ERenaud, JGreen, JFarley, DCutting, BJahnke, W Arylaminoethyl amides as novel non-covalent cathepsin K inhibitors. J Med Chem 45:2352-4 (2002)  
Target
Name:
Cathepsin S
Synonyms:
CATS_HUMAN Cathepsin S (Cat S) | cathepsin S preproprotein
Type:
Protein
Mol. Mass.:
37507.38
Organism:
Homo sapiens (Human)
Description:
P25774
Residue:
331
  
Inhibitor
Name:
BDBM50113663
Synonyms:
CHEMBL77471 | N-{1-[2-(4-Methoxy-phenylamino)-ethylcarbamoyl]-3-methyl-butyl}-4-propyl-benzamide
Type:
Small organic molecule
Emp. Form.:
C25H35N3O3
Mol. Mass.:
425.5637
SMILES:
CCCc1ccc(cc1)C(=O)N[C@@H](CC(C)C)C(=O)NCCNc1ccc(OC)cc1
: