Target
Vasopressin V1a receptor
Ligand
BDBM50114033
Substrate
Meas. Tech.
ChEMBL_214412 (CHEMBL820276)
Ki
1.01±n/a nM
Citation
 Kakefuda, ASuzuki, TTobe, TTsukada, JTahara, ASakamoto, STsukamoto, S Synthesis and pharmacological evaluation of 5-(4-biphenyl)-3-methyl-4-phenyl-1,2,4-triazole derivatives as a novel class of selective antagonists for the human vasopressin V(1A) receptor. J Med Chem 45:2589-98 (2002)  
Target
Name:
Vasopressin V1a receptor
Synonyms:
AVPR V1a AVPR1A V1AR_HUMAN VASOPRESSIN V1A Vasopressin V1 receptor Vasopressin receptor
Type:
Receptor
Mol. Mass.:
46820.18
Organism:
Homo sapiens (Human)
Description:
P37288
Residue:
418
  
Inhibitor
Name:
BDBM50114033
Synonyms:
CHEMBL86667 | {4-[2-(3-Biphenyl-4-yl-5-methyl-[1,2,4]triazol-4-yl)-3-methyl-phenoxymethyl]-phenyl}-[1,4']bipiperidinyl-1'-yl-methanone
Type:
Small organic molecule
Emp. Form.:
C40H43N5O2
Mol. Mass.:
625.8017
SMILES:
Cc1nnc(-c2ccc(cc2)-c2ccccc2)n1-c1c(C)cccc1OCc1ccc(cc1)C(=O)N1CCC(CC1)N1CCCCC1
: