Target
Coagulation factor X
Ligand
BDBM50114440
Substrate
Meas. Tech.
ChEBML_49164
IC50
>11000±n/a nM
Citation
 Jia, ZJWu, YHuang, WGoldman, EZhang, PWoolfrey, JWong, PHuang, BSinha, UPark, GReed, AScarborough, RMZhu, BY Design, synthesis and biological activity of novel non-amidine factor Xa inhibitors. Part 1: P(1) structure-activity relationships of the substituted 1-(2-Naphthyl)-1H-pyrazole-5-carboxylamides. Bioorg Med Chem Lett 12:1651-5 (2002)  
Target
Name:
Coagulation factor X
Synonyms:
Activated coagulation factor X (FXa) Coagulation factor X precursor F10 Factor X heavy chain Factor Xa Stuart-Prower factor
Type:
Enzyme
Mol. Mass.:
54726.60
Organism:
Homo sapiens (Human)
Description:
Residue:
488
  
Inhibitor
Name:
BDBM50114440
Synonyms:
2-(6-Chloro-benzothiazol-2-yl)-5-methyl-2H-pyrazole-3-carboxylic acid (2'-sulfamoyl-biphenyl-4-yl)-amide | CHEMBL46876
Type:
Small organic molecule
Emp. Form.:
C24H18ClN5O3S2
Mol. Mass.:
524.014
SMILES:
Cc1cc(C(=O)Nc2ccc(cc2)-c2ccccc2S(N)(=O)=O)n(n1)-c1nc2ccc(Cl)cc2s1
: